{"text_format":"1","workbook":"xlsx","n_sheets":3,"sheets":["Introduction","Planning Ratios","Support"],"not_rendered":{"charts":0,"images":0,"macros":1,"external_links":0,"defined_names":11,"comments":0,"pivot_tables":0},"unopened":[],"bounds":{"document_bytes":16777216,"sheet_cells":100000,"rows_first":2000,"rows_last":500,"rows_between":2000,"halvings":0,"cell_chars":16384,"cell_head_chars":4096},"cells_cut":0,"cells_raw":0,"read":"whole","date_system":"1900"}

{"sheet":"Introduction","index":0,"n_rows":27,"n_cols":2,"rows_kept":27,"cut":false,"hidden":false,"merged":[[1,1,1,8],[3,1,3,8]]}
[]
[null,{"$f":"'Planning Ratios'!B2","v":"Retirement Planning Ratio Forecasts (LT25)"}]
[]
[null,"Personal Finance: Another Perspective"]
[]
[null,"Purpose:"]
[null,"The purpose of this spreadsheet is to give an Excel template for determining where you are in your"]
[null,"progress toward your retirement goals.  Special thanks to Ryan Huling who put"]
[null,"together the idea for this spreadsheet.  It is based on the article from the WSJ by Jonathan"]
[null,"Clements on: \"Ugly Math:  How Soaring Housing Costs are Jeopardizing Retirement Savings,\""]
[null,"March 25, 2005, p. D1.  The article makes some major assumptions which include:  1.  Investors "]
[null,"will earn 5% morethan inflation; 2.  Investors will save 12% of pre-tax income every year"]
[null,"from age 30 to 65; and 3.  Investors will withdraw 5% of portfolio value each year. "]
[]
[null,"Additional Assumptions:"]
[null,"With this spreadsheeet, we assume:  1.  Housing payments are expenses, and investors can handle "]
[null,"up to the recommended 36% of gross salary for housing.  2.  Additional payments to housing "]
[null,"expenses come out of savings.  3.  Individual inputs for assumptions are consistent and achievable. "]
[null,"4.  Tax savings on interest payments are considered part of expenses.  5.  The amount of "]
[null,"retirement savings desired is a multiple of income."]
[]
[null,"Disclosure:"]
[null,"The purpose of this spreadsheet and this class is to help you get your financial house in"]
[null,"order and to help you on your road to financial self-reliance.  If there are mistakes in this "]
[null,"spreadsheet, please bring them to our attention and we will correct them in upcoming "]
[null,"versions.  The teacher, and BYU, specifically disclaim any liability, or responsibility for "]
[null,"claims, loss, or risk incurred, directly or indirectly, from using this material."]

{"sheet":"Planning Ratios","index":1,"n_rows":117,"n_cols":22,"rows_kept":117,"cut":false,"hidden":false,"merged":[[31,10,31,11],[30,10,30,11],[1,1,1,11],[2,1,2,11],[29,7,29,9],[10,2,10,5],[8,2,8,11]]}
[]
[null,"Retirement Planning Ratio Forecasts (LT25)"]
[null,"Personal Finance: Another Perspective"]
[]
[null,"Special thanks to Ryan Huling who put together the idea for this spreadsheet.  It is based on the article from the WSJ by Jonathan Clements on: \"Ugly Math:  How Soaring"]
[null,"Housing Costs are Jeopardizing Retirement Savings,\" March 25, 2005, p. D1.  The article makes some major assumptions which include:  1.  Investors will 5% more"]
[null,"than inflation; 2.  Investors will save 12% of pre-tax income every year from age 30 to 65; and 3.  Investors will withdraw 5% of portfolio value each year.  With our model, "]
[null,"we assume:  1.  Housing payments are expenses; 2. Prepayments are out of savings; and 3.  You can set additional parameters depending on your situation."]
[null,null,"Retirement Planning Ratio Forecasts (LT25)"]
[]
[null,null,"Debt and Income Information"]
[null,null,"Age at beginning of employment",null,null,45,null,"Estiomated Savings and Debt to Income Ratios",null,null,"WSJ Recommended Ratios"]
[null,null,"Starting Income",null,null,82000,null,"Age","Savings","Debt","Savings","Debt"]
[null,null,"Average annual increase in income",null,null,1.4999999999999999E-2,null,25,{"$f":"IF(H14>=Age,VLOOKUP($H14,$B$36:$L$117,10),\"\")","v":""},{"$f":"IF(H14>=Age,VLOOKUP($H14,$B$36:$L$117,11),\"\")","v":""}]
[null,null,"Age at retirement",null,null,65,null,30,{"$f":"IF(H15>=Age,VLOOKUP($H15,$B$36:$L$117,10),\"NA\")","v":"NA"},{"$f":"IF(H15>=Age,VLOOKUP($H15,$B$36:$L$117,11),\"NA\")","v":"NA"},0.1,1.7]
[null,null,"Years in Retirement",null,null,30,null,35,"NA","NA",0.9,1.5]
[null,null,"Number of Working Years",null,null,{"$f":"Age_at_Retirement-F12","v":20},null,40,"NA","NA",1.8,1.25]
[null,null,"Estimated Annuity Rate (in %)",null,null,0.04,null,45,1.602439024390244,1.8623977017421485,3,1]
[null,null,"Estimated Payout Percentage (in %)",null,null,0.04,null,50,3.2786847078756027,1.2168869237250801,4.5,0.75]
[null,null,null,null,null,null,null,55,5.4610444904154827,0.55145967434955734,6.5,0.5]
[null,null,"Annual percent of salary saved",null,null,0.2,null,60,8.3023309840186243,0,8.9,0.2]
[null,null,"Current Savings ",null,null,115000,null,65,12.001495990320286,0,12,0]
[null,null,"Return on Investment",null,null,7.0000000000000007E-2,null,null,null,null,"Note 1","Note 2"]
[null,null,"Assumed inflation rate",null,null,null,null,"Total Savings at Retirement",null,null,"Annuity Pymt","Payout Pymt"]
[null,null,null,null,null,null,null,"Total Savings",null,{"$f":"VLOOKUP(Age_at_Retirement,$B$36:$L$118,5)","v":1325470.5467735683},{"$f":"PMT($F$18,$F$16,J25*-1)","v":76652.093118663746},{"$f":"J25*F19","v":53018.821870942731}]
[null,null,"Age when you purchase(d) home",null,null,30,{"$f":"IF(K31<>\"\",\"Too Much Debt\",\"\")","v":""},"Savings to Income / % of Salary",null,{"$f":"J25/VLOOKUP(Age_at_Retirement,$B$36:$L$117,2)","v":12.001495990320286},{"$f":"K25/VLOOKUP(Age_at_Retirement,$B$37:$T$117,2)","v":0.6940477028724612},{"$f":"L25/VLOOKUP(Age_at_Retirement,$B$37:$T$117,2)","v":0.48005983961281146}]
[null,null,"Cost of the home",null,null,250000,{"$f":"IF(K31<>\"\",\"for Salary\",\"\")","v":""},"Total Inflation-adjusted Savings",null,{"$f":"VLOOKUP(Age_at_Retirement,$B$36:$T$118,15)","v":880456.83358765719},{"$f":"PMT(((1+$F$18)/(1+F24)-1),$F$16,J27*-1)","v":50916.905969283805},{"$f":"J27*0.05","v":44022.841679382866}]
[null,null,"Down Payment",null,null,null,null,"Savings to Income / % of Salary",null,{"$f":"J27/VLOOKUP(Age_at_Retirement,$B$36:$L$117,2)","v":7.9721116275830024},{"$f":"K27/VLOOKUP(Age_at_Retirement,$B$37:$T$117,16)","v":0.4610280057277395},{"$f":"L27/VLOOKUP(Age_at_Retirement,$B$37:$T$117,16)","v":0.3986055813791502}]
[null,null,"Mortgage amount",null,null,{"$f":"F27-F28","v":250000}]
[null,null,"Taxes and Insurance",null,null,3000,null,"As a % of Salary",null,null,"PITI should be less than 36%"]
[null,null,"Mortgage interest rate",null,null,0.04,null,"Mortgage Payment before Prepmt",null,{"$f":"R35","v":0.21289664370018702},{"$f":"IF(J31>0.36,\"Not within Mortgage\",\"\")","v":""}]
[null,null,"Mortgage term",null,null,30,{"$f":"IF(MIN(E37:E117)<0,\"Not Enough\",\"\")","v":""},"Notes:",null,null,{"$f":"IF(J31>0.36,\"Payment Guidelines\",\"\")","v":""}]
[null,null,"Years to pay off loan",null,null,30,{"$f":"IF(MIN(E38:E118)<0,\"Savings to Prepay\",\"\")","v":""},"1.  The annuity payment is calculated based on your estimated annuity rate in F19."]
[null,null,"Assumed growth in home prices ",null,null,0,null,"2.  5% Payout assumes a 5% reduction in total savings per year",null,null,null,null,null,null,null,null,null,"Maximum"]
[null,null,null,null,null,null,null,null,null,null,null,null,null,null,null,null,null,{"$f":"MAX(R37:R117)","v":0.21289664370018702}]
[null,"Age","Income","Annual Savings","Net Annual Savings after Prepayment","Total Accumulated Savings","Savings to Extra Home Loan Payment","Standard Home Loan Payment","Standard Home Loan Balance","Loan Balance With additional Payments","Savings to Income Ratio","Debt to Income Ratio",null,null,null,"Inflation Adjusted Savings","Inflation Adjusted Salary","Maximum Payment as a % of Gross Salary (w/o savings)","Year","Value of Mortgage",null,"Savings after Payout"]
[null,{"$f":"F12","v":45},{"$f":"F13","v":82000},{"$f":"C37*Annual_Savings","v":16400},{"$f":"$F$21*C37-G37","v":16400},{"$f":"F22+E37","v":131400},{"$f":"IF(B37>=Support!$A$7,IF(VLOOKUP(B37,Support!$A$4:$F$47,2)>0,VLOOKUP(B37,Support!$A$4:$F$47,3)-Support!$J$7,0),0)","v":0},{"$f":"IF(B37<Support!$H$7,0,VLOOKUP(B37,Support!$H$4:$M$47,3))","v":14457.524783415336},{"$f":"IF(B37>=Support!$H$7,VLOOKUP(B37,Support!$H$4:$M$47,6),0)","v":152716.61154285618},{"$f":"IF(B37<Support!$A$7,0,VLOOKUP(B37,Support!$A$4:$F$47,6))","v":152716.61154285618},{"$f":"IF(C37>0,F37/C37,\"None\")","v":1.602439024390244},{"$f":"IF(C37>0,J37/C37,\"None\")","v":1.8623977017421485},null,null,null,{"$f":"D37","v":16400},{"$f":"C37/(1+$F$24)","v":82000},{"$f":"IF(H37=0,0,(H37+$F$30)/C37)","v":0.21289664370018702},1,{"$f":"IF(ISERR((IF(Support!$A$7=B37,Support!$B$7,IF(T36>0,T36*(1+$F$34),0)))),\"\",(IF(Support!$A$7=B37,Support!$B$7,IF(T36>0,T36*(1+$F$34),0))))","v":""}]
[null,{"$f":"B37+1","v":46},{"$f":"IF(B38<=$F$15,C37*(1+$F$14),0)","v":83229.999999999985},16645.999999999996,{"$f":"$F$21*C38-G38","v":16645.999999999996},{"$f":"(E38+F37)*(1+$F$23)","v":158409.22},{"$f":"IF(B38>=Support!$A$7,IF(VLOOKUP(B38,Support!$A$4:$F$47,2)>0,VLOOKUP(B38,Support!$A$4:$F$47,3)-Support!$J$7,0),0)","v":0},{"$f":"IF(B38<Support!$H$7,0,VLOOKUP(B38,Support!$H$4:$M$47,3))","v":14457.524783415336},{"$f":"IF(B38>=Support!$H$7,VLOOKUP(B38,Support!$H$4:$M$47,6),0)","v":144367.75122115508},{"$f":"IF(B38<Support!$A$7,0,VLOOKUP(B38,Support!$A$4:$F$47,6))","v":144367.75122115508},{"$f":"IF(C38>0,F38/C38,\"None\")","v":1.903270695662622},{"$f":"IF(C38>0,J38/C38,\"None\")","v":1.7345638738574445},null,null,null,{"$f":"(P37+E38)*(1+$F$23)/(1+$F$24)","v":35359.22},{"$f":"C38/(1+$F$24)^(S38)","v":83229.999999999985},{"$f":"IF(B38=\"\",\"\",IF(H38=0,0,(H38+$F$30)/C38))","v":0.20975038788195768},2,{"$f":"IF(ISERR((IF(Support!$A$7=B38,Support!$B$7,IF(T37>0,T37*(1+$F$34),0)))),\"\",(IF(Support!$A$7=B38,Support!$B$7,IF(T37>0,T37*(1+$F$34),0))))","v":""}]
[null,{"$f":"IF(B38=\"\",\"\",IF(B38+1>$F$15+$F$16,\"\",B38+1))","v":47},84478.449999999983,16895.689999999999,{"$f":"IF(B39=\"\",\"\",$F$21*C39-G39)","v":16895.689999999999},{"$f":"IF(B39=\"\",\"\",(E39+F38)*(1+$F$23))","v":187576.2537},{"$f":"IF(B39=\"\",\"\",IF(B39>=Support!$A$7,IF(VLOOKUP(B39,Support!$A$4:$F$47,2)>0,VLOOKUP(B39,Support!$A$4:$F$47,3)-Support!$J$7,0),0))","v":0},{"$f":"IF(B39=\"\",\"\",IF(B39<Support!$H$7,0,VLOOKUP(B39,Support!$H$4:$M$47,3)))","v":14457.524783415336},{"$f":"IF(B39=\"\",\"\",IF(B39>=Support!$H$7,VLOOKUP(B39,Support!$H$4:$M$47,6),0))","v":135684.93648658594},{"$f":"IF(B39=\"\",\"\",IF(B39<Support!$A$7,0,VLOOKUP(B39,Support!$A$4:$F$47,6)))","v":135684.93648658594},{"$f":"IF(B39=\"\",\"\",IF(C39>0,F39/C39,\"None\"))","v":2.2204035905014834},{"$f":"IF(B39=\"\",\"\",IF(C39>0,J39/C39,\"None\"))","v":1.6061485087212888},null,null,null,55912.753700000008,84478.449999999983,{"$f":"IF(C39=0,\"\",IF(H39=0,0,(H39+$F$30)/C39))","v":0.20665062845513071},3,{"$f":"IF(ISERR((IF(Support!$A$7=B39,Support!$B$7,IF(T38>0,T38*(1+$F$34),0)))),\"\",(IF(Support!$A$7=B39,Support!$B$7,IF(T38>0,T38*(1+$F$34),0))))","v":""}]
[null,48,85745.626749999981,17149.125349999998,17149.125349999998,219056.15558349999,{"$f":"IF(B40=\"\",\"\",IF(B40>=Support!$A$7,IF(VLOOKUP(B40,Support!$A$4:$F$47,2)>0,VLOOKUP(B40,Support!$A$4:$F$47,3)-Support!$J$7,0),0))","v":0},{"$f":"IF(B40=\"\",\"\",IF(B40<Support!$H$7,0,VLOOKUP(B40,Support!$H$4:$M$47,3)))","v":14457.524783415336},{"$f":"IF(B40=\"\",\"\",IF(B40>=Support!$H$7,VLOOKUP(B40,Support!$H$4:$M$47,6),0))","v":126654.80916263405},{"$f":"IF(B40=\"\",\"\",IF(B40<Support!$A$7,0,VLOOKUP(B40,Support!$A$4:$F$47,6)))","v":126654.80916263405},2.5547210264399873,1.4770993456250416,null,null,null,78176.210583500011,85745.626749999981,0.20359667828091696,4,{"$f":"IF(ISERR((IF(Support!$A$7=B40,Support!$B$7,IF(T39>0,T39*(1+$F$34),0)))),\"\",(IF(Support!$A$7=B40,Support!$B$7,IF(T39>0,T39*(1+$F$34),0))))","v":""}]
{"$rows_left_out":78}
{"sheet":"Support","index":2,"n_rows":47,"n_cols":13,"rows_kept":47,"cut":false,"hidden":false,"merged":[[0,0,0,1]]}
["Mortgage Payment Data"]
[]
[]
[null,"Starting Balance","Payment","Principle","Interest","Balance",null,null,"Starting Balance","Payment","Principle","Interest","Balance"]
[]
[]
[{"$f":"'Planning Ratios'!$F$26","v":30},{"$f":"'Planning Ratios'!$F$29","v":250000},{"$f":"-PMT('Planning Ratios'!$F$31,'Planning Ratios'!$F$33,'Planning Ratios'!$F$29)","v":14457.524783415336},{"$f":"C7-E7","v":4457.5247834153361},{"$f":"'Planning Ratios'!$F$29*'Planning Ratios'!$F$31","v":10000},{"$f":"B7-D7","v":245542.47521658466},null,{"$f":"'Planning Ratios'!$F$26","v":30},{"$f":"'Planning Ratios'!$F$29","v":250000},{"$f":"-PMT('Planning Ratios'!$F$31,Loan_Term,'Planning Ratios'!$F$29)","v":14457.524783415336},{"$f":"J7-L7","v":4457.5247834153361},{"$f":"'Planning Ratios'!$F$29*'Planning Ratios'!$F$31","v":10000},{"$f":"I7-K7","v":245542.47521658466}]
[{"$f":"A7+1","v":31},{"$f":"F7","v":245542.47521658466},{"$f":"IF(F7>C7,C7,F7+('Planning Ratios'!$F$31*F7))","v":14457.524783415336},4635.8257747519492,{"$f":"'Planning Ratios'!$F$31*B8","v":9821.6990086633868},{"$f":"F7-D8","v":240906.64944183271},null,{"$f":"H7+1","v":31},{"$f":"M7","v":245542.47521658466},{"$f":"IF(M7>J7,J7,M7+('Planning Ratios'!$F$31*M7))","v":14457.524783415336},4635.8257747519492,{"$f":"'Planning Ratios'!$F$31*I8","v":9821.6990086633868},{"$f":"M7-K8","v":240906.64944183271}]
[32,240906.64944183271,{"$f":"IF(F8>C8,C8,F8+('Planning Ratios'!$F$31*F8))","v":14457.524783415336},4821.2588057420271,{"$f":"'Planning Ratios'!$F$31*B9","v":9636.265977673309},236085.39063609068,null,32,240906.64944183271,{"$f":"IF(M8>J8,J8,M8+('Planning Ratios'!$F$31*M8))","v":14457.524783415336},4821.2588057420271,{"$f":"'Planning Ratios'!$F$31*I9","v":9636.265977673309},236085.39063609068]
[33,236085.39063609068,{"$f":"IF(F9>C9,C9,F9+('Planning Ratios'!$F$31*F9))","v":14457.524783415336},5014.1091579717086,{"$f":"'Planning Ratios'!$F$31*B10","v":9443.4156254436275},231071.28147811897,null,33,236085.39063609068,{"$f":"IF(M9>J9,J9,M9+('Planning Ratios'!$F$31*M9))","v":14457.524783415336},5014.1091579717086,{"$f":"'Planning Ratios'!$F$31*I10","v":9443.4156254436275},231071.28147811897]
[34,231071.28147811897,{"$f":"IF(F10>C10,C10,F10+('Planning Ratios'!$F$31*F10))","v":14457.524783415336},5214.6735242905779,{"$f":"'Planning Ratios'!$F$31*B11","v":9242.8512591247581},225856.60795382838,null,34,231071.28147811897,{"$f":"IF(M10>J10,J10,M10+('Planning Ratios'!$F$31*M10))","v":14457.524783415336},5214.6735242905779,{"$f":"'Planning Ratios'!$F$31*I11","v":9242.8512591247581},225856.60795382838]
[35,225856.60795382838,{"$f":"IF(F11>C11,C11,F11+('Planning Ratios'!$F$31*F11))","v":14457.524783415336},5423.2604652622013,{"$f":"'Planning Ratios'!$F$31*B12","v":9034.2643181531348},220433.34748856619,null,35,225856.60795382838,{"$f":"IF(M11>J11,J11,M11+('Planning Ratios'!$F$31*M11))","v":14457.524783415336},5423.2604652622013,{"$f":"'Planning Ratios'!$F$31*I12","v":9034.2643181531348},220433.34748856619]
[36,220433.34748856619,{"$f":"IF(F12>C12,C12,F12+('Planning Ratios'!$F$31*F12))","v":14457.524783415336},5640.1908838726886,{"$f":"'Planning Ratios'!$F$31*B13","v":8817.3338995426475},214793.1566046935,null,36,220433.34748856619,{"$f":"IF(M12>J12,J12,M12+('Planning Ratios'!$F$31*M12))","v":14457.524783415336},5640.1908838726886,{"$f":"'Planning Ratios'!$F$31*I13","v":8817.3338995426475},214793.1566046935]
[37,214793.1566046935,{"$f":"IF(F13>C13,C13,F13+('Planning Ratios'!$F$31*F13))","v":14457.524783415336},5865.7985192275955,{"$f":"'Planning Ratios'!$F$31*B14","v":8591.7262641877405},208927.35808546591,null,37,214793.1566046935,{"$f":"IF(M13>J13,J13,M13+('Planning Ratios'!$F$31*M13))","v":14457.524783415336},5865.7985192275955,{"$f":"'Planning Ratios'!$F$31*I14","v":8591.7262641877405},208927.35808546591]
[38,208927.35808546591,{"$f":"IF(F14>C14,C14,F14+('Planning Ratios'!$F$31*F14))","v":14457.524783415336},6100.4304599966999,{"$f":"'Planning Ratios'!$F$31*B15","v":8357.0943234186361},202826.92762546922,null,38,208927.35808546591,{"$f":"IF(M14>J14,J14,M14+('Planning Ratios'!$F$31*M14))","v":14457.524783415336},6100.4304599966999,{"$f":"'Planning Ratios'!$F$31*I15","v":8357.0943234186361},202826.92762546922]
[39,202826.92762546922,{"$f":"IF(F15>C15,C15,F15+('Planning Ratios'!$F$31*F15))","v":14457.524783415336},6344.4476783965665,{"$f":"'Planning Ratios'!$F$31*B16","v":8113.0771050187695},196482.47994707266,null,39,202826.92762546922,{"$f":"IF(M15>J15,J15,M15+('Planning Ratios'!$F$31*M15))","v":14457.524783415336},6344.4476783965665,{"$f":"'Planning Ratios'!$F$31*I16","v":8113.0771050187695},196482.47994707266]
[40,196482.47994707266,{"$f":"IF(F16>C16,C16,F16+('Planning Ratios'!$F$31*F16))","v":14457.524783415336},6598.2255855324292,{"$f":"'Planning Ratios'!$F$31*B17","v":7859.2991978829068},189884.25436154022,null,40,196482.47994707266,{"$f":"IF(M16>J16,J16,M16+('Planning Ratios'!$F$31*M16))","v":14457.524783415336},6598.2255855324292,{"$f":"'Planning Ratios'!$F$31*I17","v":7859.2991978829068},189884.25436154022]
[41,189884.25436154022,{"$f":"IF(F17>C17,C17,F17+('Planning Ratios'!$F$31*F17))","v":14457.524783415336},6862.1546089537269,{"$f":"'Planning Ratios'!$F$31*B18","v":7595.3701744616092},183022.09975258651,null,41,189884.25436154022,{"$f":"IF(M17>J17,J17,M17+('Planning Ratios'!$F$31*M17))","v":14457.524783415336},6862.1546089537269,{"$f":"'Planning Ratios'!$F$31*I18","v":7595.3701744616092},183022.09975258651]
[42,183022.09975258651,{"$f":"IF(F18>C18,C18,F18+('Planning Ratios'!$F$31*F18))","v":14457.524783415336},7136.6407933118753,{"$f":"'Planning Ratios'!$F$31*B19","v":7320.8839901034607},175885.45895927463,null,42,183022.09975258651,{"$f":"IF(M18>J18,J18,M18+('Planning Ratios'!$F$31*M18))","v":14457.524783415336},7136.6407933118753,{"$f":"'Planning Ratios'!$F$31*I19","v":7320.8839901034607},175885.45895927463]
[43,175885.45895927463,{"$f":"IF(F19>C19,C19,F19+('Planning Ratios'!$F$31*F19))","v":14457.524783415336},7422.1064250443505,{"$f":"'Planning Ratios'!$F$31*B20","v":7035.4183583709855},168463.35253423027,null,43,175885.45895927463,{"$f":"IF(M19>J19,J19,M19+('Planning Ratios'!$F$31*M19))","v":14457.524783415336},7422.1064250443505,{"$f":"'Planning Ratios'!$F$31*I20","v":7035.4183583709855},168463.35253423027]
[44,168463.35253423027,{"$f":"IF(F20>C20,C20,F20+('Planning Ratios'!$F$31*F20))","v":14457.524783415336},7718.9906820461247,{"$f":"'Planning Ratios'!$F$31*B21","v":6738.5341013692114},160744.36185218414,null,44,168463.35253423027,{"$f":"IF(M20>J20,J20,M20+('Planning Ratios'!$F$31*M20))","v":14457.524783415336},7718.9906820461247,{"$f":"'Planning Ratios'!$F$31*I21","v":6738.5341013692114},160744.36185218414]
[45,160744.36185218414,{"$f":"IF(F21>C21,C21,F21+('Planning Ratios'!$F$31*F21))","v":14457.524783415336},8027.7503093279702,{"$f":"'Planning Ratios'!$F$31*B22","v":6429.7744740873659},152716.61154285618,null,45,160744.36185218414,{"$f":"IF(M21>J21,J21,M21+('Planning Ratios'!$F$31*M21))","v":14457.524783415336},8027.7503093279702,{"$f":"'Planning Ratios'!$F$31*I22","v":6429.7744740873659},152716.61154285618]
[46,152716.61154285618,{"$f":"IF(F22>C22,C22,F22+('Planning Ratios'!$F$31*F22))","v":14457.524783415336},8348.8603217010896,{"$f":"'Planning Ratios'!$F$31*B23","v":6108.6644617142474},144367.75122115508,null,46,152716.61154285618,{"$f":"IF(M22>J22,J22,M22+('Planning Ratios'!$F$31*M22))","v":14457.524783415336},8348.8603217010896,{"$f":"'Planning Ratios'!$F$31*I23","v":6108.6644617142474},144367.75122115508]
[47,144367.75122115508,{"$f":"IF(F23>C23,C23,F23+('Planning Ratios'!$F$31*F23))","v":14457.524783415336},8682.8147345691323,{"$f":"'Planning Ratios'!$F$31*B24","v":5774.7100488462029},135684.93648658594,null,47,144367.75122115508,{"$f":"IF(M23>J23,J23,M23+('Planning Ratios'!$F$31*M23))","v":14457.524783415336},8682.8147345691323,{"$f":"'Planning Ratios'!$F$31*I24","v":5774.7100488462029},135684.93648658594]
[48,135684.93648658594,{"$f":"IF(F24>C24,C24,F24+('Planning Ratios'!$F$31*F24))","v":14457.524783415336},9030.1273239518996,{"$f":"'Planning Ratios'!$F$31*B25","v":5427.3974594634374},126654.80916263405,null,48,135684.93648658594,{"$f":"IF(M24>J24,J24,M24+('Planning Ratios'!$F$31*M24))","v":14457.524783415336},9030.1273239518996,{"$f":"'Planning Ratios'!$F$31*I25","v":5427.3974594634374},126654.80916263405]
[49,126654.80916263405,{"$f":"IF(F25>C25,C25,F25+('Planning Ratios'!$F$31*F25))","v":14457.524783415336},9391.3324169099742,{"$f":"'Planning Ratios'!$F$31*B26","v":5066.1923665053619},117263.47674572407,null,49,126654.80916263405,{"$f":"IF(M25>J25,J25,M25+('Planning Ratios'!$F$31*M25))","v":14457.524783415336},9391.3324169099742,{"$f":"'Planning Ratios'!$F$31*I26","v":5066.1923665053619},117263.47674572407]
[50,117263.47674572407,{"$f":"IF(F26>C26,C26,F26+('Planning Ratios'!$F$31*F26))","v":14457.524783415336},9766.9857135863731,{"$f":"'Planning Ratios'!$F$31*B27","v":4690.539069828963},107496.4910321377,null,50,117263.47674572407,{"$f":"IF(M26>J26,J26,M26+('Planning Ratios'!$F$31*M26))","v":14457.524783415336},9766.9857135863731,{"$f":"'Planning Ratios'!$F$31*I27","v":4690.539069828963},107496.4910321377]
[51,107496.4910321377,{"$f":"IF(F27>C27,C27,F27+('Planning Ratios'!$F$31*F27))","v":14457.524783415336},10157.665142129828,{"$f":"'Planning Ratios'!$F$31*B28","v":4299.8596412855077},97338.825890007865,null,51,107496.4910321377,{"$f":"IF(M27>J27,J27,M27+('Planning Ratios'!$F$31*M27))","v":14457.524783415336},10157.665142129828,{"$f":"'Planning Ratios'!$F$31*I28","v":4299.8596412855077},97338.825890007865]
[52,97338.825890007865,{"$f":"IF(F28>C28,C28,F28+('Planning Ratios'!$F$31*F28))","v":14457.524783415336},10563.971747815021,{"$f":"'Planning Ratios'!$F$31*B29","v":3893.5530356003146},86774.854142192838,null,52,97338.825890007865,{"$f":"IF(M28>J28,J28,M28+('Planning Ratios'!$F$31*M28))","v":14457.524783415336},10563.971747815021,{"$f":"'Planning Ratios'!$F$31*I29","v":3893.5530356003146},86774.854142192838]
[53,86774.854142192838,{"$f":"IF(F29>C29,C29,F29+('Planning Ratios'!$F$31*F29))","v":14457.524783415336},10986.530617727622,{"$f":"'Planning Ratios'!$F$31*B30","v":3470.9941656877136},75788.323524465217,null,53,86774.854142192838,{"$f":"IF(M29>J29,J29,M29+('Planning Ratios'!$F$31*M29))","v":14457.524783415336},10986.530617727622,{"$f":"'Planning Ratios'!$F$31*I30","v":3470.9941656877136},75788.323524465217]
[54,75788.323524465217,{"$f":"IF(F30>C30,C30,F30+('Planning Ratios'!$F$31*F30))","v":14457.524783415336},11425.991842436728,{"$f":"'Planning Ratios'!$F$31*B31","v":3031.5329409786086},64362.331682028489,null,54,75788.323524465217,{"$f":"IF(M30>J30,J30,M30+('Planning Ratios'!$F$31*M30))","v":14457.524783415336},11425.991842436728,{"$f":"'Planning Ratios'!$F$31*I31","v":3031.5329409786086},64362.331682028489]
[55,64362.331682028489,{"$f":"IF(F31>C31,C31,F31+('Planning Ratios'!$F$31*F31))","v":14457.524783415336},11883.031516134197,{"$f":"'Planning Ratios'!$F$31*B32","v":2574.4932672811397},52479.300165894296,null,55,64362.331682028489,{"$f":"IF(M31>J31,J31,M31+('Planning Ratios'!$F$31*M31))","v":14457.524783415336},11883.031516134197,{"$f":"'Planning Ratios'!$F$31*I32","v":2574.4932672811397},52479.300165894296]
[56,52479.300165894296,{"$f":"IF(F32>C32,C32,F32+('Planning Ratios'!$F$31*F32))","v":14457.524783415336},12358.352776779564,{"$f":"'Planning Ratios'!$F$31*B33","v":2099.172006635772},40120.947389114735,null,56,52479.300165894296,{"$f":"IF(M32>J32,J32,M32+('Planning Ratios'!$F$31*M32))","v":14457.524783415336},12358.352776779564,{"$f":"'Planning Ratios'!$F$31*I33","v":2099.172006635772},40120.947389114735]
[57,40120.947389114735,{"$f":"IF(F33>C33,C33,F33+('Planning Ratios'!$F$31*F33))","v":14457.524783415336},12852.686887850747,{"$f":"'Planning Ratios'!$F$31*B34","v":1604.8378955645894},27268.260501263991,null,57,40120.947389114735,{"$f":"IF(M33>J33,J33,M33+('Planning Ratios'!$F$31*M33))","v":14457.524783415336},12852.686887850747,{"$f":"'Planning Ratios'!$F$31*I34","v":1604.8378955645894},27268.260501263991]
[58,27268.260501263991,{"$f":"IF(F34>C34,C34,F34+('Planning Ratios'!$F$31*F34))","v":14457.524783415336},13366.794363364777,{"$f":"'Planning Ratios'!$F$31*B35","v":1090.7304200505596},13901.466137899213,null,58,27268.260501263991,{"$f":"IF(M34>J34,J34,M34+('Planning Ratios'!$F$31*M34))","v":14457.524783415336},13366.794363364777,{"$f":"'Planning Ratios'!$F$31*I35","v":1090.7304200505596},13901.466137899213]
[59,13901.466137899213,{"$f":"IF(F35>C35,C35,F35+('Planning Ratios'!$F$31*F35))","v":14457.524783415181},13901.466137899213,{"$f":"'Planning Ratios'!$F$31*B36","v":556.05864551596858},0,null,59,13901.466137899213,{"$f":"IF(M35>J35,J35,M35+('Planning Ratios'!$F$31*M35))","v":14457.524783415181},13901.466137899213,{"$f":"'Planning Ratios'!$F$31*I36","v":556.05864551596858},0]
[60,0,{"$f":"IF(F36>C36,C36,F36+('Planning Ratios'!$F$31*F36))","v":0},0,{"$f":"'Planning Ratios'!$F$31*B37","v":0},0,null,60,0,{"$f":"IF(M36>J36,J36,M36+('Planning Ratios'!$F$31*M36))","v":0},0,{"$f":"'Planning Ratios'!$F$31*I37","v":0},0]
[61,0,{"$f":"IF(F37>C37,C37,F37+('Planning Ratios'!$F$31*F37))","v":0},0,{"$f":"'Planning Ratios'!$F$31*B38","v":0},0,null,61,0,{"$f":"IF(M37>J37,J37,M37+('Planning Ratios'!$F$31*M37))","v":0},0,{"$f":"'Planning Ratios'!$F$31*I38","v":0},0]
[62,0,{"$f":"IF(F38>C38,C38,F38+('Planning Ratios'!$F$31*F38))","v":0},0,{"$f":"'Planning Ratios'!$F$31*B39","v":0},0,null,62,0,{"$f":"IF(M38>J38,J38,M38+('Planning Ratios'!$F$31*M38))","v":0},0,{"$f":"'Planning Ratios'!$F$31*I39","v":0},0]
[63,0,{"$f":"IF(F39>C39,C39,F39+('Planning Ratios'!$F$31*F39))","v":0},0,{"$f":"'Planning Ratios'!$F$31*B40","v":0},0,null,63,0,{"$f":"IF(M39>J39,J39,M39+('Planning Ratios'!$F$31*M39))","v":0},0,{"$f":"'Planning Ratios'!$F$31*I40","v":0},0]
{"$rows_left_out":7}